BDBM50047617 1-(2,6-Diisopropyl-phenyl)-3-hexyl-urea::CHEMBL45093
SMILES CCCCCCNC(=O)Nc1c(cccc1C(C)C)C(C)C
InChI Key InChIKey=RPULZJMCCLPXAS-UHFFFAOYSA-N
Data  1 IC50
  Tab Delimited (TSV)   2D SDfile   Computed 3D by Vconf -m prep SDfile
Find this compound or compounds like it in BindingDB:
Activity Spreadsheet -- Enzyme Inhibition Constant Data from BindingDB
Found 1 hit for monomerid = 50047617
TargetAcyl-CoA:cholesterol acyltransferase(Oryctolagus cuniculus)
Warner-Lambert
Curated by ChEMBL
LigandPNGBDBM50047617(1-(2,6-Diisopropyl-phenyl)-3-hexyl-urea | CHEMBL45...)
Affinity DataIC50:  99nM. Assay description: Acyl coenzyme A:cholesterol acyltransferase (ACAT), inhibition by incubation with [1-14C]oleolyl-CoA and intestinal microsomes isolated from intestin...
In DepthDetails ArticlePubMed