BDBM50047622 CHEMBL42902::Octadecyl-thiocarbamic acid S-(2,6-dimethyl-phenyl) ester
SMILES CCCCCCCCCCCCCCCCCCNC(=O)Sc1c(C)cccc1C
InChI Key InChIKey=FQIIYEXQUKJNGI-UHFFFAOYSA-N
Data  1 IC50
  Tab Delimited (TSV)   2D SDfile   Computed 3D by Vconf -m prep SDfile
Find this compound or compounds like it in BindingDB:
Activity Spreadsheet -- Enzyme Inhibition Constant Data from BindingDB
Found 1 hit for monomerid = 50047622
TargetAcyl-CoA:cholesterol acyltransferase(Oryctolagus cuniculus)
Warner-Lambert
Curated by ChEMBL
LigandPNGBDBM50047622(CHEMBL42902 | Octadecyl-thiocarbamic acid S-(2,6-d...)
Affinity DataIC50:  2.46E+3nM. Assay description: Acyl coenzyme A:cholesterol acyltransferase (ACAT), inhibition by incubation with [1-14C]oleolyl-CoA and intestinal microsomes isolated from intestin...
In DepthDetails ArticlePubMed