BDBM50047623 1-Octadec-9-enyl-3-(2,4,6-trimethyl-phenyl)-urea::CHEMBL295580
SMILES CCCCCCCC\C=C/CCCCCCCCNC(=O)Nc1c(C)cc(C)cc1C
InChI Key InChIKey=OSKWLEJNCXBCNM-SEYXRHQNSA-N
Data  1 IC50
  Tab Delimited (TSV)   2D SDfile   Computed 3D by Vconf -m prep SDfile
Find this compound or compounds like it in BindingDB:
Activity Spreadsheet -- Enzyme Inhibition Constant Data from BindingDB
Found 1 hit for monomerid = 50047623
TargetAcyl-CoA:cholesterol acyltransferase(Oryctolagus cuniculus)
Warner-Lambert
Curated by ChEMBL
LigandPNGBDBM50047623(1-Octadec-9-enyl-3-(2,4,6-trimethyl-phenyl)-urea |...)
Affinity DataIC50:  2.90E+3nM. Assay description: Acyl coenzyme A:cholesterol acyltransferase (ACAT), inhibition by incubation with [1-14C]oleolyl-CoA and intestinal microsomes isolated from intestin...
In DepthDetails ArticlePubMed