BDBM50047624 1-(2-Ethyl-6-isopropyl-phenyl)-3-tetradecyl-urea::CHEMBL42603
SMILES CCCCCCCCCCCCCCNC(=O)Nc1c(CC)cccc1C(C)C
InChI Key InChIKey=TYZLQNQCCBAPME-UHFFFAOYSA-N
Data  1 IC50
  Tab Delimited (TSV)   2D SDfile   Computed 3D by Vconf -m prep SDfile
Find this compound or compounds like it in BindingDB:
Activity Spreadsheet -- Enzyme Inhibition Constant Data from BindingDB
Found 1 hit for monomerid = 50047624
TargetAcyl-CoA:cholesterol acyltransferase(Oryctolagus cuniculus)
Warner-Lambert
Curated by ChEMBL
LigandPNGBDBM50047624(1-(2-Ethyl-6-isopropyl-phenyl)-3-tetradecyl-urea |...)
Affinity DataIC50:  18nM. Assay description: Acyl coenzyme A:cholesterol acyltransferase (ACAT), inhibition by incubation with [1-14C]oleolyl-CoA and intestinal microsomes isolated from intestin...
In DepthDetails ArticlePubMed