BDBM50047634 1-(1,1-Dimethyl-undecyl)-3-(2-ethyl-phenyl)-urea::CHEMBL45379
SMILES CCCCCCCCCCC(C)(C)NC(=O)Nc1ccccc1CC
InChI Key InChIKey=HJNZKAHZQCGIET-UHFFFAOYSA-N
Data  1 IC50
  Tab Delimited (TSV)   2D SDfile   Computed 3D by Vconf -m prep SDfile
Find this compound or compounds like it in BindingDB:
Activity Spreadsheet -- Enzyme Inhibition Constant Data from BindingDB
Found 1 hit for monomerid = 50047634
TargetAcyl-CoA:cholesterol acyltransferase(Oryctolagus cuniculus)
Warner-Lambert
Curated by ChEMBL
LigandPNGBDBM50047634(1-(1,1-Dimethyl-undecyl)-3-(2-ethyl-phenyl)-urea |...)
Affinity DataIC50:  500nM. Assay description: Acyl coenzyme A:cholesterol acyltransferase (ACAT), inhibition by incubation with [1-14C]oleolyl-CoA and intestinal microsomes isolated from intestin...
In DepthDetails ArticlePubMed