BDBM50047638 1-(2-Methoxy-phenyl)-3-octadec-9-enyl-urea::CHEMBL297184
SMILES CCCCCCCC\C=C/CCCCCCCCNC(=O)Nc1ccccc1OC
InChI Key InChIKey=MYFINVLBDMDVJK-KHPPLWFESA-N
Data  1 IC50
  Tab Delimited (TSV)   2D SDfile   Computed 3D by Vconf -m prep SDfile
Find this compound or compounds like it in BindingDB:
Activity Spreadsheet -- Enzyme Inhibition Constant Data from BindingDB
Found 1 hit for monomerid = 50047638
TargetAcyl-CoA:cholesterol acyltransferase(Oryctolagus cuniculus)
Warner-Lambert
Curated by ChEMBL
LigandPNGBDBM50047638(1-(2-Methoxy-phenyl)-3-octadec-9-enyl-urea | CHEMB...)
Affinity DataIC50:  3.30E+3nM. Assay description: Acyl coenzyme A:cholesterol acyltransferase (ACAT), inhibition by incubation with [1-14C]oleolyl-CoA and intestinal microsomes isolated from intestin...
In DepthDetails ArticlePubMed