BDBM50047643 1-(1-Decyl-cyclopentyl)-3-(2,6-diethyl-phenyl)-urea::CHEMBL44480
SMILES CCCCCCCCCCC1(CCCC1)NC(=O)Nc1c(CC)cccc1CC
InChI Key InChIKey=ABWRBFWDQWUPMI-UHFFFAOYSA-N
Data  1 IC50
  Tab Delimited (TSV)   2D SDfile   Computed 3D by Vconf -m prep SDfile
Find this compound or compounds like it in BindingDB:
Activity Spreadsheet -- Enzyme Inhibition Constant Data from BindingDB
Found 1 hit for monomerid = 50047643
TargetAcyl-CoA:cholesterol acyltransferase(Oryctolagus cuniculus)
Warner-Lambert
Curated by ChEMBL
LigandPNGBDBM50047643(1-(1-Decyl-cyclopentyl)-3-(2,6-diethyl-phenyl)-ure...)
Affinity DataIC50:  110nM. Assay description: Acyl coenzyme A:cholesterol acyltransferase (ACAT), inhibition by incubation with [1-14C]oleolyl-CoA and intestinal microsomes isolated from intestin...
In DepthDetails ArticlePubMed