BDBM50047649 1-Decyl-3-(2-ethyl-6-isopropyl-phenyl)-urea::CHEMBL47105
SMILES CCCCCCCCCCNC(=O)Nc1c(CC)cccc1C(C)C
InChI Key InChIKey=QJIAPYWWXIFWSK-UHFFFAOYSA-N
Data  1 IC50
  Tab Delimited (TSV)   2D SDfile   Computed 3D by Vconf -m prep SDfile
Find this compound or compounds like it in BindingDB:
Activity Spreadsheet -- Enzyme Inhibition Constant Data from BindingDB
Found 1 hit for monomerid = 50047649
TargetAcyl-CoA:cholesterol acyltransferase(Oryctolagus cuniculus)
Warner-Lambert
Curated by ChEMBL
LigandPNGBDBM50047649(1-Decyl-3-(2-ethyl-6-isopropyl-phenyl)-urea | CHEM...)
Affinity DataIC50:  87nM. Assay description: Acyl coenzyme A:cholesterol acyltransferase (ACAT), inhibition by incubation with [1-14C]oleolyl-CoA and intestinal microsomes isolated from intestin...
In DepthDetails ArticlePubMed