BDBM50047660 1-Decyl-3-(2,6-diethyl-phenyl)-urea::CHEMBL42343
SMILES CCCCCCCCCCNC(=O)Nc1c(CC)cccc1CC
InChI Key InChIKey=QXRSVZGLQRCGAQ-UHFFFAOYSA-N
Data  1 IC50
  Tab Delimited (TSV)   2D SDfile   Computed 3D by Vconf -m prep SDfile
Find this compound or compounds like it in BindingDB:
Activity Spreadsheet -- Enzyme Inhibition Constant Data from BindingDB
Found 1 hit for monomerid = 50047660
TargetAcyl-CoA:cholesterol acyltransferase(Oryctolagus cuniculus)
Warner-Lambert
Curated by ChEMBL
LigandPNGBDBM50047660(1-Decyl-3-(2,6-diethyl-phenyl)-urea | CHEMBL42343)
Affinity DataIC50:  100nM. Assay description: Acyl coenzyme A:cholesterol acyltransferase (ACAT), inhibition by incubation with [1-14C]oleolyl-CoA and intestinal microsomes isolated from intestin...
In DepthDetails ArticlePubMed