BDBM50048199 CHEMBL356997::N-[6-(4-Isopropyl-phenylsulfanyl)-1-oxo-indan-5-yl]-methanesulfonamide
SMILES CC(C)c1ccc(Sc2cc3C(=O)CCc3cc2NS(C)(=O)=O)cc1
InChI Key InChIKey=HNCXIINJFVYAGP-UHFFFAOYSA-N
Data  1 IC50
  Tab Delimited (TSV)   2D SDfile   Computed 3D by Vconf -m prep SDfile
Find this compound or compounds like it in BindingDB:
Activity Spreadsheet -- Enzyme Inhibition Constant Data from BindingDB
Found 1 hit for monomerid = 50048199
TargetProstaglandin G/H synthase 2(Homo sapiens (Human))
Merck Frosst Centre For Therapeutic Research
Curated by ChEMBL
LigandPNGBDBM50048199(CHEMBL356997 | N-[6-(4-Isopropyl-phenylsulfanyl)-1...)
Affinity DataIC50: >1.00E+4nM. Assay description: In vitro inhibition of prostaglandin G/H synthase 2 expressed in human osteosarcoma 143 cells
In DepthDetails ArticlePubMed