BDBM50048850 CHEMBL3310338
SMILES Cc1cc(O)cc(c1)-c1c(cnn1C)-c1cc(NCCCCO)nc(n1)-c1cccnc1
InChI Key InChIKey=NCSGHASLVGIKIQ-UHFFFAOYSA-N
Data  1 IC50
  Tab Delimited (TSV)   2D SDfile   Computed 3D by Vconf -m prep SDfile
Find this compound or compounds like it in BindingDB:
Activity Spreadsheet -- Enzyme Inhibition Constant Data from BindingDB
Found 1 hit for monomerid = 50048850
TargetProto-oncogene tyrosine-protein kinase ROS(Homo sapiens (Human))
Yonsei University
Curated by ChEMBL
LigandPNGBDBM50048850(CHEMBL3310338)
Affinity DataIC50:  25nM. Assay description: Inhibition of ROS1 (unknown origin) assessed as remaining activity
In DepthDetails ArticlePubMed