BDBM50049049 CHEMBL119907::Tetradecanoic acid (R)-2-hydroxymethyl-5-oxo-tetrahydro-furan-2-ylmethyl ester
SMILES CCCCCCCCCCCCCC(=O)OC[C@]1(CO)CCC(=O)O1
InChI Key InChIKey=IJBRVCLEYDEESF-HXUWFJFHSA-N
Data  1 KI
  Tab Delimited (TSV)   2D SDfile   Computed 3D by Vconf -m prep SDfile
Find this compound or compounds like it in BindingDB:
Activity Spreadsheet -- Enzyme Inhibition Constant Data from BindingDB
Found 1 hit for monomerid = 50049049
TargetProtein kinase C alpha type(Homo sapiens (Human))
National Cancer Institute-Bethesda
Curated by ChEMBL
LigandPNGBDBM50049049(CHEMBL119907 | Tetradecanoic acid (R)-2-hydroxymet...)
Affinity DataKi:  96nM. Assay description: Displacement of phorbol 12,13-dibutyrate (PDBU) from Protein kinase C alpha
In DepthDetails ArticlePubMed