BDBM50050563 CHEMBL3309349
SMILES [H][C@@]12CC=C(CO)[C@H](CC[C@H](C)CC(=O)OCCCCN3CCOCC3)[C@@]1(C)CCCC2(C)C
InChI Key InChIKey=UFWGYDLSUPDOLS-JCUKEYOKSA-N
Data  2 IC50
  Tab Delimited (TSV)   2D SDfile   Computed 3D by Vconf -m prep SDfile
Find this compound or compounds like it in BindingDB:
Activity Spreadsheet -- Enzyme Inhibition Constant Data from BindingDB
Found 2 hits for monomerid = 50050563
TargetAcetylcholinesterase(Tetronarce californica (Pacific electric ray) (Tor...)
Universidad Nacional Del Sur
Curated by ChEMBL
LigandPNGBDBM50050563(CHEMBL3309349)
Affinity DataIC50: >5.00E+4nM. Assay description: Inhibition of Torpedo californica AChE by spectrophotometry based Ellman's method
In DepthDetails ArticlePubMed
TargetCholinesterase(Equus caballus (Horse))
Universidad Nacional Del Sur
Curated by ChEMBL
LigandPNGBDBM50050563(CHEMBL3309349)
Affinity DataIC50: >5.00E+4nM. Assay description: Inhibition of horse serum BChE by spectrophotometry based Ellman's method
In DepthDetails ArticlePubMed