BDBM50052170 (S)-3-(4-Chloro-phenyl)-8-methyl-2-(3-phenyl-[1,2,4]oxadiazol-5-yl)-8-aza-bicyclo[3.2.1]octane::CHEMBL419324
SMILES CN1C2CCC1[C@H](C(C2)c1ccc(Cl)cc1)c1nc(no1)-c1ccccc1
InChI Key InChIKey=MLEBXCGNNIYOSJ-WSXZXBBNSA-N
Data  1 KI  3 IC50
  Tab Delimited (TSV)   2D SDfile   Computed 3D by Vconf -m prep SDfile
Find this compound or compounds like it in BindingDB:
Activity Spreadsheet -- Enzyme Inhibition Constant Data from BindingDB
Found 4 hits for monomerid = 50052170
TargetSodium-dependent dopamine transporter(Rattus norvegicus (rat))
Research Triangle Institute
Curated by ChEMBL
LigandPNGBDBM50052170((S)-3-(4-Chloro-phenyl)-8-methyl-2-(3-phenyl-[1,2,...)
Affinity DataKi:  0.590nM. Assay description: Ability to inhibit [3H]dopamine uptake into rat striatal synaptosomes
In DepthDetails ArticlePubMed
TargetTransporter(Rattus norvegicus)
Research Triangle Institute
Curated by ChEMBL
LigandPNGBDBM50052170((S)-3-(4-Chloro-phenyl)-8-methyl-2-(3-phenyl-[1,2,...)
Affinity DataIC50:  245nM. Assay description: Binding affinity against Norepinephrine transporter using [3H]nisoxetine in midbrain of rat
In DepthDetails ArticlePubMed
TargetSodium-dependent serotonin transporter(Rattus norvegicus (rat))
Research Triangle Institute
Curated by ChEMBL
LigandPNGBDBM50052170((S)-3-(4-Chloro-phenyl)-8-methyl-2-(3-phenyl-[1,2,...)
Affinity DataIC50:  195nM. Assay description: Binding affinity against serotonin transporter using [3H]paroxetine in rat frontal cortex
In DepthDetails ArticlePubMed
TargetSodium-dependent dopamine transporter(Rattus norvegicus (rat))
Research Triangle Institute
Curated by ChEMBL
LigandPNGBDBM50052170((S)-3-(4-Chloro-phenyl)-8-methyl-2-(3-phenyl-[1,2,...)
Affinity DataIC50:  1.60nM. Assay description: Binding affinity against Dopamine transporter using [3H]WIN-35 428 in rat striatum
In DepthDetails ArticlePubMed