BDBM50052642 CHEMBL3318569
SMILES O=C(N1CCN(CC1)c1ncccn1)c1ccc(NCc2ccccc2)cc1
InChI Key InChIKey=DZUCBXJLKUSLEV-UHFFFAOYSA-N
Data  1 IC50
  Tab Delimited (TSV)   2D SDfile   Computed 3D by Vconf -m prep SDfile
Find this compound or compounds like it in BindingDB:
Activity Spreadsheet -- Enzyme Inhibition Constant Data from BindingDB
Found 1 hit for monomerid = 50052642
TargetSodium-dependent proline transporter(Homo sapiens (Human))
Lexicon Pharmaceuticals
Curated by ChEMBL
LigandPNGBDBM50052642(CHEMBL3318569)
Affinity DataIC50:  870nM. Assay description: Inhibition of human high-affinity L-proline transporter expressed in COS1 cells by [3H]proline uptake assay
In DepthDetails ArticlePubMed