BDBM50052644 CHEMBL3318567
SMILES O=C(N1CCN(CC1)c1ncccn1)c1ccc(OCc2ccccc2)cc1
InChI Key InChIKey=CIWQTFNQROPJCC-UHFFFAOYSA-N
Data  1 IC50
  Tab Delimited (TSV)   2D SDfile   Computed 3D by Vconf -m prep SDfile
Find this compound or compounds like it in BindingDB:
Activity Spreadsheet -- Enzyme Inhibition Constant Data from BindingDB
Found 1 hit for monomerid = 50052644
TargetSodium-dependent proline transporter(Homo sapiens (Human))
Lexicon Pharmaceuticals
Curated by ChEMBL
LigandPNGBDBM50052644(CHEMBL3318567)
Affinity DataIC50:  270nM. Assay description: Inhibition of human high-affinity L-proline transporter expressed in COS1 cells by [3H]proline uptake assay
In DepthDetails ArticlePubMed