BDBM50052712 CHEMBL1508710
SMILES O=C(N1CCN(CC1)c1ccccc1)c1ccc(cc1)-c1ccccc1
InChI Key InChIKey=VHYSKWYZIZGSJB-UHFFFAOYSA-N
Data  1 IC50
  Tab Delimited (TSV)   2D SDfile   Computed 3D by Vconf -m prep SDfile
Find this compound or compounds like it in BindingDB:
Activity Spreadsheet -- Enzyme Inhibition Constant Data from BindingDB
Found 1 hit for monomerid = 50052712
TargetSodium-dependent proline transporter(Homo sapiens (Human))
Lexicon Pharmaceuticals
Curated by ChEMBL
LigandPNGBDBM50052712(CHEMBL1508710)
Affinity DataIC50:  1.48E+3nM. Assay description: Inhibition of human high-affinity L-proline transporter expressed in COS1 cells by [3H]proline uptake assay
In DepthDetails ArticlePubMed