BDBM50052730 CHEMBL3318587
SMILES Cc1ccccc1-c1ccc(cc1)C(=O)N1CCN(CC1)c1ncccn1
InChI Key InChIKey=MIPXMANSKCUCCX-UHFFFAOYSA-N
Data  1 IC50
  Tab Delimited (TSV)   2D SDfile   Computed 3D by Vconf -m prep SDfile
Find this compound or compounds like it in BindingDB:
Activity Spreadsheet -- Enzyme Inhibition Constant Data from BindingDB
Found 1 hit for monomerid = 50052730
TargetSodium-dependent proline transporter(Homo sapiens (Human))
Lexicon Pharmaceuticals
Curated by ChEMBL
LigandPNGBDBM50052730(CHEMBL3318587)
Affinity DataIC50:  653nM. Assay description: Inhibition of human high-affinity L-proline transporter expressed in COS1 cells by [3H]proline uptake assay
In DepthDetails ArticlePubMed