BDBM50053369 CHEMBL3330403
SMILES CO[C@@H](C(=O)Nc1ccc2[nH]nc(-c3cccc(c3)S(N)(=O)=O)c2c1)c1ccccc1
InChI Key
Data  1 IC50
  Tab Delimited (TSV)   2D SDfile   Computed 3D by Vconf -m prep SDfile
Find this compound or compounds like it in BindingDB:
Activity Spreadsheet -- Enzyme Inhibition Constant Data from BindingDB
Found 1 hit for monomerid = 50053369
TargetDual specificity protein kinase TTK(Homo sapiens (Human))
University Health Network
Curated by ChEMBL
LigandPNGBDBM50053369(CHEMBL3330403)
Affinity DataIC50:  30nM. Assay description: Inhibition of SUMO-tagged human TTK (1-275 residues) compound pre-incubated for 15 mins prior ATP addition by MBP-based assay
In DepthDetails ArticlePubMed