BDBM50053862 (1-{1-Benzyl-2-[2-hydroxy-2-(3-phenoxy-phenyl)-ethylcarbamoyl]-2-oxo-ethylcarbamoyl}-3-methyl-butyl)-carbamic acid benzyl ester::CHEMBL337684
SMILES CC(C)CC(NC(=O)OCc1ccccc1)C(=O)NC(Cc1ccccc1)C(=O)C(=O)NCC(O)c1cccc(Oc2ccccc2)c1
InChI Key InChIKey=BYDZMKUUIQPQOJ-UHFFFAOYSA-N
Data  3 KI
  Tab Delimited (TSV)   2D SDfile   Computed 3D by Vconf -m prep SDfile
Find this compound or compounds like it in BindingDB:
Activity Spreadsheet -- Enzyme Inhibition Constant Data from BindingDB
Found 3 hits for monomerid = 50053862
TargetCalpain-2 catalytic subunit(Homo sapiens (Human))
Georgia Institute Of Technology
Curated by ChEMBL
LigandPNGBDBM50053862((1-{1-Benzyl-2-[2-hydroxy-2-(3-phenoxy-phenyl)-eth...)
Affinity DataKi:  340nM. Assay description: Compound was evaluated for the inhibition of Cysteine protease Calpain 2
In DepthDetails ArticlePubMed
TargetCalpain-1 catalytic subunit(Homo sapiens (Human))
Georgia Institute Of Technology
Curated by ChEMBL
LigandPNGBDBM50053862((1-{1-Benzyl-2-[2-hydroxy-2-(3-phenoxy-phenyl)-eth...)
Affinity DataKi:  600nM. Assay description: Inhibition of the cysteine protease human Calpain 1
In DepthDetails ArticlePubMed
TargetCathepsin B(Bos taurus (bovine))
Georgia Institute Of Technology
Curated by ChEMBL
LigandPNGBDBM50053862((1-{1-Benzyl-2-[2-hydroxy-2-(3-phenoxy-phenyl)-eth...)
Affinity DataKi:  640nM. Assay description: Inhibition of bovine cathepsin B
In DepthDetails ArticlePubMed