BDBM50054157 3-{3-[4,7-dibenzyl-5,6-dihydroxy-2-oxo-3-[3-(3-pyridylcarbamoyl)benzyl]-(4R,5S,6S,7R)-1,3-diazepan-1-ylmethyl]phenylcarboxamido}pyridine::CHEMBL433404
SMILES O[C@@H]1[C@@H](O)[C@@H](Cc2ccccc2)N(Cc2cccc(c2)C(=O)Nc2cccnc2)C(=O)N(Cc2cccc(c2)C(=O)Nc2cccnc2)[C@@H]1Cc1ccccc1
InChI Key InChIKey=PFIHOIVFDOGGJU-GLGKVNTQSA-N
Data  3 KI
  Tab Delimited (TSV)   2D SDfile   Computed 3D by Vconf -m prep SDfile
Find this compound or compounds like it in BindingDB:
Activity Spreadsheet -- Enzyme Inhibition Constant Data from BindingDB
Found 1 hit for monomerid = 50054157
TargetGag-Pol polyprotein [489-587](Human immunodeficiency virus type 1)
Lindsley F. Kimball Research Institute
Curated by ChEMBL
LigandPNGBDBM50054157(3-{3-[4,7-dibenzyl-5,6-dihydroxy-2-oxo-3-[3-(3-pyr...)
Affinity DataKi:  0.290nM. Assay description: Inhibition of HIV-1 protease
In DepthDetails ArticlePubMed