BDBM50056429 CHEMBL3326914
SMILES Cc1cc2c(NC(=O)N[C@@H]3CC(CF)(CF)Oc4cc(Cl)ccc34)c(F)ccc2cn1
InChI Key InChIKey=HHCTVDPCVPYKCO-GOSISDBHSA-N
Data  1 IC50
  Tab Delimited (TSV)   2D SDfile   Computed 3D by Vconf -m prep SDfile
Find this compound or compounds like it in BindingDB:
Activity Spreadsheet -- Enzyme Inhibition Constant Data from BindingDB
Found 1 hit for monomerid = 50056429
LigandPNGBDBM50056429(CHEMBL3326914)
Affinity DataIC50:  22nM. Assay description: Antagonist activity against human TRPV1 expressed in HEK293 cells assessed as capsaicin-induced calcium flux by FLIPR assay
In DepthDetails ArticlePubMed