BDBM50056795 CHEMBL353396::Deaminooxytocin Trisulfide
SMILES CC[C@H](C)[C@@H]1NC(=O)[C@H](Cc2ccc(O)cc2)NC(=O)CCSSSC[C@@H](NC(=O)[C@H](CC(N)=O)NC(=O)[C@H](CCC(N)=O)NC1=O)C(=O)N1CCC[C@H]1C(=O)N[C@@H](CC(C)C)C(=O)NCC(N)=O
InChI Key InChIKey=MQUDGMCUJBZYJS-FAJKJHJLSA-N
Data  1 KI
  Tab Delimited (TSV)   2D SDfile   Computed 3D by Vconf -m prep SDfile
Find this compound or compounds like it in BindingDB:
Activity Spreadsheet -- Enzyme Inhibition Constant Data from BindingDB
Found 1 hit for monomerid = 50056795
TargetOxytocin receptor(RAT)
University Of Minnesota
Curated by ChEMBL
LigandPNGBDBM50056795(CHEMBL353396 | Deaminooxytocin Trisulfide)
Affinity DataKi:  3nM. Assay description: Binding affinity against Oxytocin receptor was determined in rat uterine membrane using radioligand [3H]-oxytocin
In DepthDetails ArticlePubMed