BDBM50058757 CHEMBL3335423
SMILES O=C(Nc1ccc(cc1)C#CC12CC3CC(CC(C3)C1)C2)c1ccc(CN2CCN(Cc3cccnc3)CC2)cc1
InChI Key InChIKey=TWWJWKGWDGOUJI-UHFFFAOYSA-N
Data  1 IC50
  Tab Delimited (TSV)   2D SDfile   Computed 3D by Vconf -m prep SDfile
Find this compound or compounds like it in BindingDB:
Activity Spreadsheet -- Enzyme Inhibition Constant Data from BindingDB
Found 1 hit for monomerid = 50058757
LigandPNGBDBM50058757(CHEMBL3335423)
Affinity DataIC50:  0.970nM. Assay description: Inhibition of HIF1 signaling in human U251 cells expressing VEGF by VEGF promoter-driven PLAP reporter gene assay
In DepthDetails ArticlePubMed