BDBM50058769 CHEMBL3335412
SMILES FC(F)(F)c1ccc(NC(=O)c2ccc(CC3CCN(Cc4ccncc4)CC3)cc2)cc1
InChI Key InChIKey=ZSQSPMPLTBBXJV-UHFFFAOYSA-N
Data  1 IC50
  Tab Delimited (TSV)   2D SDfile   Computed 3D by Vconf -m prep SDfile
Find this compound or compounds like it in BindingDB:
Activity Spreadsheet -- Enzyme Inhibition Constant Data from BindingDB
Found 1 hit for monomerid = 50058769
LigandPNGBDBM50058769(CHEMBL3335412)
Affinity DataIC50:  110nM. Assay description: Inhibition of HIF1 signaling in human U251 cells expressing VEGF by VEGF promoter-driven PLAP reporter gene assay
In DepthDetails ArticlePubMed