BDBM50059557 7-Chloro-2-(2,3-dimethoxy-phenyl)-5,5-dioxo-2,3,5,10-tetrahydro-1H-5lambda*6*-phenothiazin-4-one::CHEMBL92956
SMILES COc1cccc(C2CC(=O)C3C(C2)=Nc2ccc(Cl)cc2S3(=O)=O)c1OC
InChI Key InChIKey=DIBKCKZXBFTWSV-UHFFFAOYSA-N
Data  1 IC50
  Tab Delimited (TSV)   2D SDfile   Computed 3D by Vconf -m prep SDfile
Find this compound or compounds like it in BindingDB:
Activity Spreadsheet -- Enzyme Inhibition Constant Data from BindingDB
Found 1 hit for monomerid = 50059557
TargetFalcipain 2(Plasmodium falciparum)
Universidad Central De Venezuela
Curated by ChEMBL
LigandPNGBDBM50059557(7-Chloro-2-(2,3-dimethoxy-phenyl)-5,5-dioxo-2,3,5,...)
Affinity DataIC50:  4.00E+3nM. Assay description: Inhibition of falcipain activity
In DepthDetails ArticlePubMed