BDBM50059561 7-Chloro-2-(3-methoxy-phenyl)-2,3-dihydro-1H,10H-phenothiazin-4-one::CHEMBL329337
SMILES COc1cccc(c1)C1CC(=O)C2Sc3cc(Cl)ccc3N=C2C1
InChI Key InChIKey=GTYBBGOQUBWUGY-UHFFFAOYSA-N
Data  1 IC50
  Tab Delimited (TSV)   2D SDfile   Computed 3D by Vconf -m prep SDfile
Find this compound or compounds like it in BindingDB:
Activity Spreadsheet -- Enzyme Inhibition Constant Data from BindingDB
Found 1 hit for monomerid = 50059561
TargetFalcipain 2(Plasmodium falciparum)
Universidad Central De Venezuela
Curated by ChEMBL
LigandPNGBDBM50059561(7-Chloro-2-(3-methoxy-phenyl)-2,3-dihydro-1H,10H-p...)
Affinity DataIC50:  2.00E+4nM. Assay description: Inhibition of falcipain activity
In DepthDetails ArticlePubMed