BDBM50059563 2-(4-Chloro-phenyl)-7-fluoro-5,5-dioxo-2,3,5,10-tetrahydro-1H-5lambda*6*-phenothiazin-4-one::CHEMBL414179
SMILES Fc1ccc2N=C3CC(CC(=O)C3S(=O)(=O)c2c1)c1ccc(Cl)cc1
InChI Key InChIKey=XJMCTXXLDDDLFK-UHFFFAOYSA-N
Data  1 IC50
  Tab Delimited (TSV)   2D SDfile   Computed 3D by Vconf -m prep SDfile
Find this compound or compounds like it in BindingDB:
Activity Spreadsheet -- Enzyme Inhibition Constant Data from BindingDB
Found 1 hit for monomerid = 50059563
TargetFalcipain 2(Plasmodium falciparum)
Universidad Central De Venezuela
Curated by ChEMBL
LigandPNGBDBM50059563(2-(4-Chloro-phenyl)-7-fluoro-5,5-dioxo-2,3,5,10-te...)
Affinity DataIC50:  5.00E+3nM. Assay description: Inhibition of falcipain activity
In DepthDetails ArticlePubMed