BDBM50059564 2-(3,4-Dimethoxy-phenyl)-7-fluoro-5,5-dioxo-2,3,5,10-tetrahydro-1H-5lambda*6*-phenothiazin-4-one::CHEMBL329532
SMILES COc1ccc(cc1OC)C1CC(=O)C2C(C1)=Nc1ccc(F)cc1S2(=O)=O
InChI Key InChIKey=PZDHLGRBQSAGSK-UHFFFAOYSA-N
Data  1 IC50
  Tab Delimited (TSV)   2D SDfile   Computed 3D by Vconf -m prep SDfile
Find this compound or compounds like it in BindingDB:
Activity Spreadsheet -- Enzyme Inhibition Constant Data from BindingDB
Found 1 hit for monomerid = 50059564
TargetFalcipain 2(Plasmodium falciparum)
Universidad Central De Venezuela
Curated by ChEMBL
LigandPNGBDBM50059564(2-(3,4-Dimethoxy-phenyl)-7-fluoro-5,5-dioxo-2,3,5,...)
Affinity DataIC50:  5.00E+3nM. Assay description: Inhibition of falcipain activity
In DepthDetails ArticlePubMed