BDBM50059565 2-(3,4-Dimethoxy-phenyl)-7-fluoro-2,3-dihydro-1H,10H-phenothiazin-4-one::CHEMBL91233
SMILES COc1ccc(cc1OC)C1CC(=O)C2Sc3cc(F)ccc3N=C2C1
InChI Key InChIKey=LFGRCLMOFIJXRX-UHFFFAOYSA-N
Data  1 IC50
  Tab Delimited (TSV)   2D SDfile   Computed 3D by Vconf -m prep SDfile
Find this compound or compounds like it in BindingDB:
Activity Spreadsheet -- Enzyme Inhibition Constant Data from BindingDB
Found 1 hit for monomerid = 50059565
TargetFalcipain 2(Plasmodium falciparum)
Universidad Central De Venezuela
Curated by ChEMBL
LigandPNGBDBM50059565(2-(3,4-Dimethoxy-phenyl)-7-fluoro-2,3-dihydro-1H,1...)
Affinity DataIC50:  2.00E+4nM. Assay description: Inhibition of falcipain activity
In DepthDetails ArticlePubMed