BDBM50059572 7-Fluoro-2,2-dimethyl-5,5-dioxo-2,3,5,10-tetrahydro-1H-5lambda*6*-phenothiazin-4-one::CHEMBL91049
SMILES CC1(C)CC(=O)C2C(C1)=Nc1ccc(F)cc1S2(=O)=O
InChI Key InChIKey=RSEBODLMQKDAGY-UHFFFAOYSA-N
Data  1 IC50
  Tab Delimited (TSV)   2D SDfile   Computed 3D by Vconf -m prep SDfile
Find this compound or compounds like it in BindingDB:
Activity Spreadsheet -- Enzyme Inhibition Constant Data from BindingDB
Found 1 hit for monomerid = 50059572
TargetFalcipain 2(Plasmodium falciparum)
Universidad Central De Venezuela
Curated by ChEMBL
LigandPNGBDBM50059572(7-Fluoro-2,2-dimethyl-5,5-dioxo-2,3,5,10-tetrahydr...)
Affinity DataIC50:  5.00E+3nM. Assay description: Inhibition of falcipain activity
In DepthDetails ArticlePubMed