BDBM50059574 7-Fluoro-2-(3-methoxy-phenyl)-2,3-dihydro-1H,10H-phenothiazin-4-one::CHEMBL93465
SMILES COc1cccc(c1)C1CC(=O)C2Sc3cc(F)ccc3N=C2C1
InChI Key InChIKey=BIYZSUOXHGMACH-UHFFFAOYSA-N
Data  1 IC50
  Tab Delimited (TSV)   2D SDfile   Computed 3D by Vconf -m prep SDfile
Find this compound or compounds like it in BindingDB:
Activity Spreadsheet -- Enzyme Inhibition Constant Data from BindingDB
Found 1 hit for monomerid = 50059574
TargetFalcipain 2(Plasmodium falciparum)
Universidad Central De Venezuela
Curated by ChEMBL
LigandPNGBDBM50059574(7-Fluoro-2-(3-methoxy-phenyl)-2,3-dihydro-1H,10H-p...)
Affinity DataIC50:  2.00E+4nM. Assay description: Inhibition of falcipain activity
In DepthDetails ArticlePubMed