BDBM50059575 7-Fluoro-2-phenyl-2,3-dihydro-1H,10H-phenothiazin-4-one::CHEMBL93466
SMILES Fc1ccc2N=C3CC(CC(=O)C3Sc2c1)c1ccccc1
InChI Key InChIKey=WBMCFLMVFHLYNV-UHFFFAOYSA-N
Data  1 IC50
  Tab Delimited (TSV)   2D SDfile   Computed 3D by Vconf -m prep SDfile
Find this compound or compounds like it in BindingDB:
Activity Spreadsheet -- Enzyme Inhibition Constant Data from BindingDB
Found 1 hit for monomerid = 50059575
TargetFalcipain 2(Plasmodium falciparum)
Universidad Central De Venezuela
Curated by ChEMBL
LigandPNGBDBM50059575(7-Fluoro-2-phenyl-2,3-dihydro-1H,10H-phenothiazin-...)
Affinity DataIC50:  2.00E+4nM. Assay description: Inhibition of falcipain activity
In DepthDetails ArticlePubMed