BDBM50062677 5-{4-[((Z)-2-Hex-2-enyl)-phenyl]-but-3-ynyl}-3,4-dihydroxy-5H-furan-2-one::CHEMBL133317
SMILES CCC\C=C/Cc1ccccc1C#CCCc1oc(O)c(O)c1O
InChI Key InChIKey=NFDWFFCVWCNKCQ-PLNGDYQASA-N
Data  1 IC50
  Tab Delimited (TSV)   2D SDfile   Computed 3D by Vconf -m prep SDfile
Find this compound or compounds like it in BindingDB:
Activity Spreadsheet -- Enzyme Inhibition Constant Data from BindingDB
Found 1 hit for monomerid = 50062677
TargetPolyunsaturated fatty acid 5-lipoxygenase(Rattus norvegicus)
Oxis International
Curated by ChEMBL
LigandPNGBDBM50062677(5-{4-[((Z)-2-Hex-2-enyl)-phenyl]-but-3-ynyl}-3,4-d...)
Affinity DataIC50:  400nM. Assay description: Inhibitory activity against 5-lipoxygenase obtained from rat basophilic leukemia cells
In DepthDetails ArticlePubMed