BDBM50062678 3,4-Dihydroxy-5-(4-naphthalen-1-yl-but-3-ynyl)-5H-furan-2-one::CHEMBL135483
SMILES Oc1oc(CCC#Cc2cccc3ccccc23)c(O)c1O
InChI Key InChIKey=TZIAWONGKDSEJY-UHFFFAOYSA-N
Data  1 IC50
  Tab Delimited (TSV)   2D SDfile   Computed 3D by Vconf -m prep SDfile
Find this compound or compounds like it in BindingDB:
Activity Spreadsheet -- Enzyme Inhibition Constant Data from BindingDB
Found 1 hit for monomerid = 50062678
TargetPolyunsaturated fatty acid 5-lipoxygenase(Rattus norvegicus)
Oxis International
Curated by ChEMBL
LigandPNGBDBM50062678(3,4-Dihydroxy-5-(4-naphthalen-1-yl-but-3-ynyl)-5H-...)
Affinity DataIC50:  300nM. Assay description: Inhibitory activity against 5-lipoxygenase obtained from rat basophilic leukemia cells
In DepthDetails ArticlePubMed