BDBM50064807 2-Biphenyl-4-ylmethyl-4,5-dihydro-1H-imidazole::CHEMBL306940
SMILES C(C1=NCCN1)c1ccc(cc1)-c1ccccc1
InChI Key InChIKey=QZQWOXMRSZUXFA-UHFFFAOYSA-N
Data  2 KI
  Tab Delimited (TSV)   2D SDfile   Computed 3D by Vconf -m prep SDfile
Find this compound or compounds like it in BindingDB:
Activity Spreadsheet -- Enzyme Inhibition Constant Data from BindingDB
Found 2 hits for monomerid = 50064807
Target5-hydroxytryptamine receptor 1B(Homo sapiens (Human))
Virginia Commonwealth University
Curated by ChEMBL
LigandPNGBDBM50064807(2-Biphenyl-4-ylmethyl-4,5-dihydro-1H-imidazole | C...)
Affinity DataKi: >1.00E+4nM. Assay description: Binding affinity towards human 5-hydroxytryptamine 1B receptor using [3H]-5-HT trifluoroacetate as radioligand
In DepthDetails ArticlePubMed
Target5-hydroxytryptamine receptor 1D(Homo sapiens (Human))
Virginia Commonwealth University
Curated by ChEMBL
LigandPNGBDBM50064807(2-Biphenyl-4-ylmethyl-4,5-dihydro-1H-imidazole | C...)
Affinity DataKi: >1.00E+4nM. Assay description: Binding affinity towards human 5-hydroxytryptamine 1D receptor using [3H]-5-HT trifluoroacetate as radioligand
In DepthDetails ArticlePubMed