BDBM50066370 5-Methyl-pyridine-2-sulfonic acid {6-(2-hydroxy-ethoxy)-5-(2-methoxy-phenoxy)-2-[2-(2H-tetrazol-5-yl)-pyridin-4-yl]-pyrimidin-4-yl}-amide::CHEMBL109648::clazosentan
SMILES COc1ccccc1Oc1c(NS(=O)(=O)c2ccc(C)cn2)nc(nc1OCCO)-c1ccnc(c1)-c1nnn[nH]1
InChI Key InChIKey=LFWCJABOXHSRGC-UHFFFAOYSA-N
Data  2 KI  4 IC50
  Tab Delimited (TSV)   2D SDfile   Computed 3D by Vconf -m prep SDfile
Find this compound or compounds like it in BindingDB:
Activity Spreadsheet -- Enzyme Inhibition Constant Data from BindingDB
Found 6 hits for monomerid = 50066370
TargetEndothelin-1 receptor(Homo sapiens (Human))
Abbott Laboratories
Curated by ChEMBL
LigandPNGBDBM50066370(5-Methyl-pyridine-2-sulfonic acid {6-(2-hydroxy-et...)
Affinity DataKi:  0.130nM. Assay description: Tested for binding affinity for human Endothelin A receptor by measuring its ability to displace [125I]-ET-1 from chinese hamster ovary cells(CHO)
In DepthDetails ArticlePubMed
TargetEndothelin receptor type B(Homo sapiens (Human))
Abbott Laboratories
Curated by ChEMBL
LigandPNGBDBM50066370(5-Methyl-pyridine-2-sulfonic acid {6-(2-hydroxy-et...)
Affinity DataKi:  175nM. Assay description: Tested for binding affinity for human Endothelin B receptor by measuring its ability to displace [125I]-ET-3 from chinese hamster ovary cells(CHO)
In DepthDetails ArticlePubMed
TargetEndothelin-1 receptor(Homo sapiens (Human))
Abbott Laboratories
Curated by ChEMBL
LigandPNGBDBM50066370(5-Methyl-pyridine-2-sulfonic acid {6-(2-hydroxy-et...)
Affinity DataIC50:  1.70nM. Assay description: Displacement of 125I-ET1 from ETA receptor (unknown origin) expressed in CHO cells
In DepthDetails ArticlePubMed
TargetEndothelin receptor type B(Homo sapiens (Human))
Abbott Laboratories
Curated by ChEMBL
LigandPNGBDBM50066370(5-Methyl-pyridine-2-sulfonic acid {6-(2-hydroxy-et...)
Affinity DataIC50:  175nM. Assay description: Displacement of radioligand from ETB receptor in human placenta cell membranes
In DepthDetails ArticlePubMed
TargetEndothelin-1 receptor(Homo sapiens (Human))
Abbott Laboratories
Curated by ChEMBL
LigandPNGBDBM50066370(5-Methyl-pyridine-2-sulfonic acid {6-(2-hydroxy-et...)
Affinity DataIC50:  1.70nM. Assay description: Displacement of 125I-ET1 from ETA receptor (unknown origin) expressed in CHO cells
In DepthDetails ArticlePubMed
TargetEndothelin receptor type B(Homo sapiens (Human))
Abbott Laboratories
Curated by ChEMBL
LigandPNGBDBM50066370(5-Methyl-pyridine-2-sulfonic acid {6-(2-hydroxy-et...)
Affinity DataIC50:  175nM. Assay description: Displacement of radioligand from ETB receptor in human placenta cell membranes
In DepthDetails ArticlePubMed