BDBM50067117 4-Methoxy-N-(2-pyridin-2-yl-quinazolin-4-yl)-benzamide::CHEMBL130499
SMILES COc1ccc(cc1)C(=O)Nc1nc(nc2ccccc12)-c1ccccn1
InChI Key InChIKey=TTYULORVZLXLQA-UHFFFAOYSA-N
Data  1 KI
  Tab Delimited (TSV)   2D SDfile   Computed 3D by Vconf -m prep SDfile
Find this compound or compounds like it in BindingDB:
Activity Spreadsheet -- Enzyme Inhibition Constant Data from BindingDB
Found 1 hit for monomerid = 50067117
TargetAdenosine receptor A3(Homo sapiens (Human))
Vrije Universiteit
Curated by ChEMBL
LigandPNGBDBM50067117(4-Methoxy-N-(2-pyridin-2-yl-quinazolin-4-yl)-benza...)
Affinity DataKi:  1.50E+5nM. Assay description: Tested for antagonist activity by displacement of specific [125I]-AB-MECA binding at human Adenosine A3 receptor expressed in HEK 293 cells.
In DepthDetails ArticlePubMed