BDBM50068354 CHEMBL3402326
SMILES COc1ccc2cc(ccc2c1)C(C)c1nc2s\c(=C/c3cccc4ccccc34)c(=O)n2n1
InChI Key InChIKey=KIZWKGIIOPQZIS-XYGWBWBKSA-N
Data  2 IC50
  Tab Delimited (TSV)   2D SDfile   Computed 3D by Vconf -m prep SDfile
Find this compound or compounds like it in BindingDB:
Activity Spreadsheet -- Enzyme Inhibition Constant Data from BindingDB
Found 2 hits for monomerid = 50068354
TargetProstaglandin G/H synthase 2(Homo sapiens (Human))
Hacettepe University
Curated by ChEMBL
LigandPNGBDBM50068354(CHEMBL3402326)
Affinity DataIC50:  6.82E+4nM. Assay description: Inhibition of human recombinant COX-2 using PGH2 as substrate incubated for 10 mins prior to arachidonic acid addition measured after 2 mins by EIA
In DepthDetails ArticlePubMed
TargetProstaglandin G/H synthase 1(Ovis aries (Sheep))
Hacettepe University
Curated by ChEMBL
LigandPNGBDBM50068354(CHEMBL3402326)
Affinity DataIC50:  8.56E+4nM. Assay description: Inhibition of ovine recombinant COX-1 using PGH2 as substrate incubated for 10 mins prior to arachidonic acid addition measured after 2 mins by EIA
In DepthDetails ArticlePubMed