BDBM50068355 CHEMBL3402332
SMILES COc1ccc2cc(ccc2c1)C(C)c1nc2s\c(=C/c3ccc(C)s3)c(=O)n2n1
InChI Key InChIKey=CIIFPTDYENWNLM-NDENLUEZSA-N
Data  2 IC50
  Tab Delimited (TSV)   2D SDfile   Computed 3D by Vconf -m prep SDfile
Find this compound or compounds like it in BindingDB:
Activity Spreadsheet -- Enzyme Inhibition Constant Data from BindingDB
Found 2 hits for monomerid = 50068355
TargetProstaglandin G/H synthase 2(Homo sapiens (Human))
Hacettepe University
Curated by ChEMBL
LigandPNGBDBM50068355(CHEMBL3402332)
Affinity DataIC50:  2.05E+4nM. Assay description: Inhibition of human recombinant COX-2 using PGH2 as substrate incubated for 10 mins prior to arachidonic acid addition measured after 2 mins by EIA
In DepthDetails ArticlePubMed
TargetProstaglandin G/H synthase 1(Ovis aries (Sheep))
Hacettepe University
Curated by ChEMBL
LigandPNGBDBM50068355(CHEMBL3402332)
Affinity DataIC50: >1.00E+5nM. Assay description: Inhibition of ovine recombinant COX-1 using PGH2 as substrate incubated for 10 mins prior to arachidonic acid addition measured after 2 mins by EIA
In DepthDetails ArticlePubMed