BDBM50068459 1-[2-(4-Methoxy-phenyl)-ethyl]-4-(3-phenyl-propyl)-piperazine::CHEMBL144490
SMILES COc1ccc(CCN2CCN(CCCc3ccccc3)CC2)cc1
InChI Key InChIKey=PPMWKOUCHYHRKC-UHFFFAOYSA-N
Data  4 KI
  Tab Delimited (TSV)   2D SDfile   Computed 3D by Vconf -m prep SDfile
Find this compound or compounds like it in BindingDB:
Activity Spreadsheet -- Enzyme Inhibition Constant Data from BindingDB
Found 4 hits for monomerid = 50068459
TargetSigma non-opioid intracellular receptor 1(Homo sapiens (Human))
National Institute Of Diabetes And Digestive And Kidney Diseases
Curated by ChEMBL
LigandPNGBDBM50068459(1-[2-(4-Methoxy-phenyl)-ethyl]-4-(3-phenyl-propyl)...)
Affinity DataKi:  1.30nM. Assay description: Binding affinity was tested against sigma-1 receptor in guinea brain membranes.
In DepthDetails ArticlePubMed
TargetSigma non-opioid intracellular receptor 1(Cavia porcellus (Guinea pig))
University Of Missouri
Curated by ChEMBL
LigandPNGBDBM50068459(1-[2-(4-Methoxy-phenyl)-ethyl]-4-(3-phenyl-propyl)...)
Affinity DataKi:  1.30nM. Assay description: Displacement of [3H]-(+)-pentazocine from sigma1 receptor in guinea pig brain membrane after 150 mins by scintillation counting analysis
In DepthDetails ArticlePubMed
TargetSodium-dependent dopamine transporter(MOUSE)
University Of Missouri
Curated by ChEMBL
LigandPNGBDBM50068459(1-[2-(4-Methoxy-phenyl)-ethyl]-4-(3-phenyl-propyl)...)
Affinity DataKi:  1.47E+3nM. Assay description: Displacement of [3H]RTI-121 from mouse DAT in striatal membranes
In DepthDetails ArticlePubMed
TargetSodium-dependent serotonin transporter(MOUSE)
University Of Missouri
Curated by ChEMBL
LigandPNGBDBM50068459(1-[2-(4-Methoxy-phenyl)-ethyl]-4-(3-phenyl-propyl)...)
Affinity DataKi:  1.73E+3nM. Assay description: Displacement of [3H]paroxetine from mouse SERT in whole brain membrane
In DepthDetails ArticlePubMed