BDBM50068644 Acetic acid (2R,3R,4R,5R,6R)-3-acetoxy-5,6-diethoxy-8-oxo-2-phenyl-oxocan-4-yl ester::CHEMBL357806
SMILES CCO[C@@H]1CC(=O)O[C@@H]([C@@H](OC(C)=O)[C@H](OC(C)=O)[C@@H]1OCC)c1ccccc1
InChI Key InChIKey=AGPVKYQQAJPEGH-GHRYLNIYSA-N
Data  1 IC50
  Tab Delimited (TSV)   2D SDfile   Computed 3D by Vconf -m prep SDfile
Find this compound or compounds like it in BindingDB:
Activity Spreadsheet -- Enzyme Inhibition Constant Data from BindingDB
Found 1 hit for monomerid = 50068644
LigandPNGBDBM50068644(Acetic acid (2R,3R,4R,5R,6R)-3-acetoxy-5,6-diethox...)
Affinity DataIC50:  3.90E+3nM. Assay description: Compound was tested for NADH oxidase activity in bovine heart submitochondrial particles
In DepthDetails ArticlePubMed