BDBM50068645 (4R,5S,6S,7S,8R)-4,5-Diethoxy-6,7-dihydroxy-8-phenyl-oxocan-2-one::CHEMBL148748
SMILES CCO[C@@H]1CC(=O)O[C@@H]([C@@H](O)[C@H](O)[C@@H]1OCC)c1ccccc1
InChI Key InChIKey=SQYLKABADVTAFS-UVLCOCDESA-N
Data  1 IC50
  Tab Delimited (TSV)   2D SDfile   Computed 3D by Vconf -m prep SDfile
Find this compound or compounds like it in BindingDB:
Activity Spreadsheet -- Enzyme Inhibition Constant Data from BindingDB
Found 1 hit for monomerid = 50068645
LigandPNGBDBM50068645((4R,5S,6S,7S,8R)-4,5-Diethoxy-6,7-dihydroxy-8-phen...)
Affinity DataIC50:  4.40E+3nM. Assay description: Compound was tested for NADH oxidase activity in bovine heart submitochondrial particles
In DepthDetails ArticlePubMed