BDBM50068956 3-(2-{3-[(Naphthalene-2-carbonyl)-amino]-2-oxo-2H-pyridin-1-yl}-butyrylamino)-4-oxo-5-(2-oxo-2H-pyridin-1-yl)-pentanoic acid::CHEMBL425849
SMILES CCC(C(=O)NC(CC(O)=O)C(=O)Cn1ccccc1=O)n1cccc(NC(=O)c2ccc3ccccc3c2)c1=O
InChI Key InChIKey=HRJATFCSISMPNO-UHFFFAOYSA-N
Data  1 KI
  Tab Delimited (TSV)   2D SDfile   Computed 3D by Vconf -m prep SDfile
Find this compound or compounds like it in BindingDB:
Activity Spreadsheet -- Enzyme Inhibition Constant Data from BindingDB
Found 1 hit for monomerid = 50068956
TargetCaspase-1(Homo sapiens (Human))
Ferring Research Institute
Curated by ChEMBL
LigandPNGBDBM50068956(3-(2-{3-[(Naphthalene-2-carbonyl)-amino]-2-oxo-2H-...)
Affinity DataKi:  1.65E+3nM. Assay description: Inhibition of human recombinant IL-1 beta converting enzyme
In DepthDetails ArticlePubMed