BDBM50069941 CHEMBL321163::Sodium; 9-fluoro-3-o-tolyl-6H-thiochromeno[4,3-b]quinoline-7-carboxylate
SMILES Cc1ccccc1-c1ccc-2c(SCc3c-2nc2ccc(F)cc2c3C([O-])=O)c1
InChI Key InChIKey=MPMVDRFOTJRFTF-UHFFFAOYSA-M
Data  1 KI
  Tab Delimited (TSV)   2D SDfile   Computed 3D by Vconf -m prep SDfile
Find this compound or compounds like it in BindingDB:
Activity Spreadsheet -- Enzyme Inhibition Constant Data from BindingDB
Found 1 hit for monomerid = 50069941
TargetDihydroorotate dehydrogenase (quinone), mitochondrial(Homo sapiens (Human))
Dupont Pharmaceuticals
Curated by ChEMBL
LigandPNGBDBM50069941(CHEMBL321163 | Sodium; 9-fluoro-3-o-tolyl-6H-thioc...)
Affinity DataKi:  27nM. Assay description: Inhibition of human recombinant dihydroorotate dehydrogenase (DHODase)
In DepthDetails ArticlePubMed