BDBM50070479 CHEMBL3408788
SMILES COc1ccc(CN2C(=O)c3c(C2=O)c(Cl)c(Cl)c(Cl)c3Cl)cc1
InChI Key InChIKey=WWMOURIEUSVACP-UHFFFAOYSA-N
Data  2 IC50
  Tab Delimited (TSV)   2D SDfile   Computed 3D by Vconf -m prep SDfile
Find this compound or compounds like it in BindingDB:
Activity Spreadsheet -- Enzyme Inhibition Constant Data from BindingDB
Found 2 hits for monomerid = 50070479
TargetProstaglandin G/H synthase 2(Ovis aries (Sheep))
King Saud University
Curated by ChEMBL
LigandPNGBDBM50070479(CHEMBL3408788)
Affinity DataIC50:  4.10E+3nM. Assay description: Inhibition of ovine COX2 assessed as inhibition of PGF2alpha production from PGH2 preincubated for 5 mins before arachidonic acid addition measured a...
In DepthDetails ArticlePubMed
TargetProstaglandin G/H synthase 1(Ovis aries (Sheep))
King Saud University
Curated by ChEMBL
LigandPNGBDBM50070479(CHEMBL3408788)
Affinity DataIC50: >1.00E+5nM. Assay description: Inhibition of ovine COX1 assessed as inhibition of PGF2alpha production from PGH2 preincubated for 5 mins before arachidonic acid addition measured a...
In DepthDetails ArticlePubMed