BDBM50071915 4-[2-(4-Fluoro-phenyl)-5-phenyl-1H-pyrrol-3-yl]-pyridine::CHEMBL314219
SMILES Fc1ccc(cc1)-c1[nH]c(cc1-c1ccncc1)-c1ccccc1
InChI Key InChIKey=HECGYLJLTJNLNO-UHFFFAOYSA-N
Data  1 IC50
  Tab Delimited (TSV)   2D SDfile   Computed 3D by Vconf -m prep SDfile
Find this compound or compounds like it in BindingDB:
Activity Spreadsheet -- Enzyme Inhibition Constant Data from BindingDB
Found 1 hit for monomerid = 50071915
TargetMitogen-activated protein kinase 14(Rattus norvegicus)
Merck Research Laboratory
Curated by ChEMBL
LigandPNGBDBM50071915(4-[2-(4-Fluoro-phenyl)-5-phenyl-1H-pyrrol-3-yl]-py...)
Affinity DataIC50:  12nM. Assay description: Inhibitory potency evaluated against rat p38 kinase
In DepthDetails ArticlePubMed