BDBM50072515 CHEMBL110180::{(S)-4-Methyl-7-[(5-methyl-1H-imidazo[4,5-b]pyridin-2-ylmethyl)-carbamoyl]-3-oxo-2,3,4,5-tetrahydro-1H-benzo[e][1,4]diazepin-2-yl}-acetic acid
SMILES CN1Cc2cc(ccc2N[C@@H](CC(O)=O)C1=O)C(=O)NCc1nc2nc(C)ccc2[nH]1
InChI Key InChIKey=FWZQYRSTSNFMQB-INIZCTEOSA-N
Data  1 KI
  Tab Delimited (TSV)   2D SDfile   Computed 3D by Vconf -m prep SDfile
Find this compound or compounds like it in BindingDB:
Activity Spreadsheet -- Enzyme Inhibition Constant Data from BindingDB
Found 1 hit for monomerid = 50072515
TargetIntegrin alpha-V/beta-3(Homo sapiens (Human))
Smithkline Beecham Pharmaceuticals
Curated by ChEMBL
LigandPNGBDBM50072515(CHEMBL110180 | {(S)-4-Methyl-7-[(5-methyl-1H-imida...)
Affinity DataKi:  45nM. Assay description: Antagonistic activity for human vitronectin receptor (alphaV-beta3) from platelets
In DepthDetails ArticlePubMed