BDBM50073035 1N-[1-(1H-3-indolylmethyl)-2-oxo-2-[4-oxospiro[3,4-dihydro-2H-chromene-2,4'-(hexahydropyridine)]-1-yl]-(1R)-ethyl]-2-amino-2-methylpropanamide::CHEMBL268231
SMILES CC(C)(N)C(=O)N[C@H](Cc1c[nH]c2ccccc12)C(=O)N1CCC2(CC1)CC(=O)c1ccccc1O2
InChI Key InChIKey=PWYFBILTTKVNAG-JOCHJYFZSA-N
Data  1 EC50
  Tab Delimited (TSV)   2D SDfile   Computed 3D by Vconf -m prep SDfile
Find this compound or compounds like it in BindingDB:
Activity Spreadsheet -- Enzyme Inhibition Constant Data from BindingDB
Found 1 hit for monomerid = 50073035
TargetGrowth hormone secretagogue receptor type 1(Rattus norvegicus)
Merck Research Laboratories
Curated by ChEMBL
LigandPNGBDBM50073035(1N-[1-(1H-3-indolylmethyl)-2-oxo-2-[4-oxospiro[3,4...)
Affinity DataEC50:  37nM. Assay description: In vitro growth hormone release was determined in rat pituitary cell assay
In DepthDetails ArticlePubMed