BDBM50073038 1N-[2-[1-hydroxyspiro[2,3-dihydro-1H-indene-2,4'-(hexahydropyridine)]-1-yl]-1-(1H-3-indolylmethyl)-2-oxo-(1R)-ethyl]-2-amino-2-methylpropanamide::CHEMBL13891
SMILES CC(C)(N)C(=O)N[C@H](Cc1c[nH]c2ccccc12)C(=O)N1CCC2(Cc3ccccc3C2O)CC1
InChI Key InChIKey=MTTHLYGQGYOPFK-MIHMCVIASA-N
Data  1 EC50
  Tab Delimited (TSV)   2D SDfile   Computed 3D by Vconf -m prep SDfile
Find this compound or compounds like it in BindingDB:
Activity Spreadsheet -- Enzyme Inhibition Constant Data from BindingDB
Found 1 hit for monomerid = 50073038
TargetGrowth hormone secretagogue receptor type 1(Rattus norvegicus)
Merck Research Laboratories
Curated by ChEMBL
LigandPNGBDBM50073038(1N-[2-[1-hydroxyspiro[2,3-dihydro-1H-indene-2,4'-(...)
Affinity DataEC50:  19nM. Assay description: In vitro growth hormone release was determined in rat pituitary cell assay
In DepthDetails ArticlePubMed